{"text_format":"1","workbook":"xlsx","n_sheets":3,"sheets":["MyProgram","MyChoice","S"],"not_rendered":{"charts":0,"images":0,"macros":1,"external_links":0,"defined_names":0,"comments":0,"pivot_tables":0},"unopened":[],"bounds":{"document_bytes":16777216,"sheet_cells":100000,"rows_first":2000,"rows_last":500,"rows_between":2000,"halvings":0,"cell_chars":16384,"cell_head_chars":4096},"cells_cut":0,"cells_raw":0,"read":"whole","date_system":"1900"}

{"sheet":"MyProgram","index":0,"n_rows":321,"n_cols":11,"rows_kept":321,"cut":false,"hidden":false,"merged":[[6,4,7,4],[6,6,7,6],[309,4,310,4],[309,6,310,6],[9,8,9,9],[10,8,10,9],[319,4,320,4],[319,6,320,6],[9,4,10,4],[9,6,10,6],[315,4,316,4],[315,6,316,6],[283,4,284,4],[283,6,284,6],[285,4,286,4],[285,6,286,6],[287,4,288,4],[287,6,288,6],[267,4,268,4],[267,6,268,6],[269,4,270,4],[269,6,270,6],[271,4,272,4],[271,6,272,6],[109,0,109,2],[110,4,111,4],[110,6,111,6],[112,0,112,2],[299,4,300,4],[299,6,300,6],[301,4,302,4],[301,6,302,6],[305,4,306,4],[305,6,306,6],[289,4,290,4],[289,6,290,6],[291,4,292,4],[291,6,292,6],[293,4,294,4],[293,6,294,6],[295,4,296,4],[295,6,296,6],[297,4,298,4],[297,6,298,6],[279,4,280,4],[279,6,280,6],[281,4,282,4],[281,6,282,6],[275,4,276,4],[275,6,276,6],[277,4,278,4],[277,6,278,6],[257,4,258,4],[257,6,258,6],[261,4,262,4],[261,6,262,6],[263,4,264,4],[263,6,264,6],[265,4,266,4],[265,6,266,6],[247,4,248,4],[247,6,248,6],[249,4,250,4],[249,6,250,6],[251,4,252,4],[251,6,252,6],[253,4,254,4],[253,6,254,6],[255,4,256,4],[255,6,256,6],[237,4,238,4],[237,6,238,6],[239,4,240,4],[239,6,240,6],[241,4,242,4],[241,6,242,6],[243,4,244,4],[243,6,244,6],[245,4,246,4],[245,6,246,6],[225,4,226,4],[225,6,226,6],[229,4,230,4],[229,6,230,6],[231,4,232,4],[231,6,232,6],[233,4,234,4],[233,6,234,6],[235,4,236,4],[235,6,236,6],[215,4,216,4],[215,6,216,6],[217,4,218,4],[217,6,218,6],[219,4,220,4],[219,6,220,6],[221,4,222,4],[221,6,222,6],[223,4,224,4],[223,6,224,6],[198,4,199,4],[198,6,199,6],[200,4,201,4],[200,6,201,6],[204,4,205,4],[204,6,205,6],[211,4,212,4],[211,6,212,6],[186,4,187,4],[188,4,189,4],[190,4,191,4],[192,4,193,4],[194,4,195,4],[196,4,197,4],[186,6,187,6],[188,6,189,6],[190,6,191,6],[192,6,193,6],[194,6,195,6],[196,6,197,6],[174,4,175,4],[176,4,177,4],[178,4,179,4],[180,4,181,4],[182,4,183,4],[184,4,185,4],[174,6,175,6],[176,6,177,6],[178,6,179,6],[180,6,181,6],[182,6,183,6],[184,6,185,6],[160,4,161,4],[162,4,163,4],[164,4,165,4],[166,4,167,4],[168,4,169,4],[170,4,171,4],[160,6,161,6],[162,6,163,6],[164,6,165,6],[166,6,167,6],[168,6,169,6],[170,6,171,6],[142,4,143,4],[140,4,141,4],[140,6,141,6],[142,6,143,6],[144,4,145,4],[146,4,147,4],[144,6,145,6],[146,6,147,6],[148,4,149,4],[150,4,151,4],[148,6,149,6],[150,6,151,6],[152,4,153,4],[154,4,155,4],[152,6,153,6],[154,6,155,6],[156,4,157,4],[156,6,157,6],[124,4,125,4],[124,6,125,6],[120,6,121,6],[128,4,129,4],[130,4,131,4],[132,4,133,4],[134,4,135,4],[136,4,137,4],[138,4,139,4],[128,6,129,6],[130,6,131,6],[132,6,133,6],[134,6,135,6],[136,6,137,6],[138,6,139,6],[114,4,115,4],[116,4,117,4],[114,6,115,6],[116,6,117,6],[118,6,119,6],[118,4,119,4],[120,4,121,4],[122,4,123,4],[122,6,123,6],[97,4,98,4],[99,4,100,4],[97,6,98,6],[99,6,100,6],[103,4,104,4],[103,6,104,6],[85,4,86,4],[87,4,88,4],[89,4,90,4],[91,4,92,4],[93,4,94,4],[95,4,96,4],[85,6,86,6],[87,6,88,6],[89,6,90,6],[91,6,92,6],[93,6,94,6],[95,6,96,6],[73,4,74,4],[75,4,76,4],[77,4,78,4],[79,4,80,4],[81,4,82,4],[83,4,84,4],[73,6,74,6],[75,6,76,6],[77,6,78,6],[79,6,80,6],[81,6,82,6],[83,6,84,6],[65,4,66,4],[67,4,68,4],[69,4,70,4],[59,6,60,6],[61,6,62,6],[63,6,64,6],[65,6,66,6],[67,6,68,6],[69,6,70,6],[51,6,52,6],[53,6,54,6],[55,6,56,6],[51,4,52,4],[53,4,54,4],[55,4,56,4],[59,4,60,4],[61,4,62,4],[63,4,64,4],[45,4,46,4],[47,4,48,4],[49,4,50,4],[27,6,28,6],[29,6,30,6],[31,6,32,6],[33,6,34,6],[35,6,36,6],[37,6,38,6],[39,6,40,6],[41,6,42,6],[43,6,44,6],[45,6,46,6],[47,6,48,6],[49,6,50,6],[27,4,28,4],[29,4,30,4],[31,4,32,4],[33,4,34,4],[35,4,36,4],[37,4,38,4],[39,4,40,4],[41,4,42,4],[43,4,44,4],[13,4,14,4],[15,4,16,4],[17,4,18,4],[19,4,20,4],[21,4,22,4],[23,4,24,4],[13,6,14,6],[15,6,16,6],[17,6,18,6],[19,6,20,6],[21,6,22,6],[23,6,24,6],[317,0,317,2],[25,0,25,2],[57,0,57,2],[71,0,71,2],[101,0,101,2],[126,0,126,2],[158,0,158,2],[172,0,172,2],[202,0,202,2],[311,0,311,2],[307,0,307,2],[303,0,303,2],[308,0,308,2],[304,0,304,2],[273,0,273,2],[259,0,259,2],[207,0,207,2],[214,0,214,2],[228,0,228,2],[213,0,213,2],[105,0,105,2],[227,0,227,2],[203,0,203,2],[206,0,206,2],[321,0,321,2],[313,0,313,2],[314,0,314,2],[318,0,318,2],[312,0,312,2],[102,0,102,2],[113,0,113,2],[127,0,127,2],[3,0,3,2],[4,0,4,2],[107,0,107,2],[26,0,26,2],[58,0,58,2],[72,0,72,2],[5,0,5,2],[8,0,8,2],[12,0,12,2],[106,0,106,2],[108,0,108,2],[260,0,260,2],[274,0,274,2],[210,0,210,2],[173,0,173,2],[208,0,208,2],[209,0,209,2],[159,0,159,2],[48,8,48,9],[15,8,15,9],[16,8,16,9],[17,8,17,9],[18,8,18,9],[19,8,19,9],[20,8,20,9],[21,8,21,9],[22,8,22,9],[23,8,23,9],[24,8,24,9],[25,8,25,9],[26,8,26,9],[27,8,27,9],[28,8,28,9],[29,8,29,9],[39,8,39,9],[40,8,40,9],[41,8,41,9],[42,8,42,9],[43,8,43,9],[44,8,44,9],[72,8,72,9],[58,8,58,9],[59,8,59,9],[60,8,60,9],[61,8,61,9],[62,8,62,9],[63,8,63,9],[73,8,73,9],[74,8,74,9],[67,8,67,9],[68,8,68,9],[69,8,69,9],[70,8,70,9],[71,8,71,9],[66,8,66,9],[88,8,88,9],[89,8,89,9],[75,8,75,9],[76,8,76,9],[77,8,77,9],[78,8,78,9],[79,8,79,9],[80,8,80,9],[81,8,81,9],[86,8,86,9],[87,8,87,9],[82,8,82,9],[83,8,83,9],[84,8,84,9],[85,8,85,9],[129,8,129,9],[124,8,124,9],[125,8,125,9],[126,8,126,9],[127,8,127,9],[90,8,90,9],[91,8,91,9],[92,8,92,9],[93,8,93,9],[94,8,94,9],[95,8,95,9],[96,8,96,9],[110,8,110,9],[111,8,111,9],[112,8,112,9],[113,8,113,9],[116,8,116,9],[117,8,117,9],[118,8,118,9],[128,8,128,9],[130,8,130,9],[131,8,131,9],[132,8,132,9],[133,8,133,9],[97,8,97,9],[98,8,98,9],[99,8,99,9],[100,8,100,9],[101,8,101,9],[102,8,102,9],[103,8,103,9],[104,8,104,9],[105,8,105,9],[106,8,106,9],[107,8,107,9],[108,8,108,9],[109,8,109,9],[119,8,119,9],[120,8,120,9],[121,8,121,9],[122,8,122,9],[123,8,123,9],[114,8,114,9],[115,8,115,9],[198,8,198,9],[199,8,199,9],[200,8,200,9],[201,8,201,9],[202,8,202,9],[203,8,203,9],[204,8,204,9],[176,8,176,9],[177,8,177,9],[178,8,178,9],[179,8,179,9],[180,8,180,9],[248,8,248,9],[249,8,249,9],[250,8,250,9],[251,8,251,9],[252,8,252,9],[205,8,205,9],[181,8,181,9],[182,8,182,9],[183,8,183,9],[184,8,184,9],[185,8,185,9],[186,8,186,9],[187,8,187,9],[188,8,188,9],[189,8,189,9],[190,8,190,9],[191,8,191,9],[192,8,192,9],[193,8,193,9],[194,8,194,9],[195,8,195,9],[196,8,196,9],[197,8,197,9],[230,8,230,9],[231,8,231,9],[232,8,232,9],[233,8,233,9],[234,8,234,9],[235,8,235,9],[245,8,245,9],[246,8,246,9],[247,8,247,9],[236,8,236,9],[237,8,237,9],[238,8,238,9],[239,8,239,9],[240,8,240,9],[241,8,241,9],[242,8,242,9],[243,8,243,9],[244,8,244,9],[221,8,221,9],[222,8,222,9],[223,8,223,9],[224,8,224,9],[225,8,225,9],[226,8,226,9],[227,8,227,9],[228,8,228,9],[229,8,229,9],[304,8,304,9],[305,8,305,9],[306,8,306,9],[307,8,307,9],[279,8,279,9],[280,8,280,9],[281,8,281,9],[282,8,282,9],[283,8,283,9],[284,8,284,9],[285,8,285,9],[286,8,286,9],[287,8,287,9],[288,8,288,9],[289,8,289,9],[290,8,290,9],[291,8,291,9],[292,8,292,9],[295,8,295,9],[296,8,296,9],[297,8,297,9],[298,8,298,9],[299,8,299,9],[300,8,300,9],[301,8,301,9],[302,8,302,9],[303,8,303,9],[0,0,1,6],[2,0,2,2],[0,8,0,9],[2,8,2,9],[3,8,3,9],[4,8,4,9],[5,8,5,9],[293,8,293,9],[294,8,294,9],[255,8,255,9],[256,8,256,9],[257,8,257,9],[258,8,258,9],[259,8,259,9],[260,8,260,9],[261,8,261,9],[262,8,262,9],[263,8,263,9],[264,8,264,9],[265,8,265,9],[32,8,32,9],[33,8,33,9],[34,8,34,9],[35,8,35,9],[36,8,36,9],[37,8,37,9],[38,8,38,9],[64,8,64,9],[65,8,65,9],[52,8,52,9],[53,8,53,9],[54,8,54,9],[55,8,55,9],[56,8,56,9],[57,8,57,9],[45,8,45,9],[46,8,46,9],[47,8,47,9],[49,8,49,9],[50,8,50,9],[51,8,51,9],[6,8,6,9],[7,8,7,9],[8,8,8,9],[11,8,11,9],[12,8,12,9],[13,8,13,9],[14,8,14,9],[30,8,30,9],[31,8,31,9],[149,8,149,9],[150,8,150,9],[151,8,151,9],[152,8,152,9],[134,8,134,9],[135,8,135,9],[136,8,136,9],[137,8,137,9],[138,8,138,9],[139,8,139,9],[140,8,140,9],[141,8,141,9],[142,8,142,9],[143,8,143,9],[144,8,144,9],[145,8,145,9],[146,8,146,9],[147,8,147,9],[148,8,148,9],[153,8,153,9],[154,8,154,9],[155,8,155,9],[156,8,156,9],[157,8,157,9],[172,8,172,9],[173,8,173,9],[174,8,174,9],[175,8,175,9],[162,8,162,9],[163,8,163,9],[164,8,164,9],[165,8,165,9],[166,8,166,9],[158,8,158,9],[159,8,159,9],[160,8,160,9],[161,8,161,9],[167,8,167,9],[168,8,168,9],[169,8,169,9],[170,8,170,9],[171,8,171,9],[206,8,206,9],[207,8,207,9],[208,8,208,9],[209,8,209,9],[210,8,210,9],[211,8,211,9],[212,8,212,9],[213,8,213,9],[214,8,214,9],[215,8,215,9],[216,8,216,9],[217,8,217,9],[218,8,218,9],[219,8,219,9],[220,8,220,9],[317,8,317,9],[318,8,318,9],[319,8,319,9],[270,8,270,9],[271,8,271,9],[272,8,272,9],[273,8,273,9],[274,8,274,9],[275,8,275,9],[276,8,276,9],[277,8,277,9],[278,8,278,9],[267,8,267,9],[268,8,268,9],[269,8,269,9],[253,8,253,9],[254,8,254,9],[266,8,266,9],[320,8,320,9],[321,8,321,9],[308,8,308,9],[309,8,309,9],[310,8,310,9],[311,8,311,9],[312,8,312,9],[313,8,313,9],[314,8,314,9],[315,8,315,9],[316,8,316,9]]}
["3DV2020 MyProgram\nSelect your time zone and your favorite papers.\nThen, your personal program will appear on the MyChoice sheet.",null,null,null,null,null,null,null,"Time Zone"]
[null,null,null,null,null,null,null,null,"UTC",9]
[]
["Day 1 : Wednesday 25 November",null,null,null,"1st Round",null,"2nd Round",null,"My Choice"]
[]
["Opening Remarks"]
["   *",null,"Opening Remarks and Paper Awards",null,{"$f":"S!B2","v":"2020-11-25T09:00:00"},null,"  ",null,null,false,0]
[" ",null," ",null,null,null,null,null,null,null,0]
["Keynote 1"]
["   *",null,"Beyond the Current Application Horizon of 3D Models",null,{"$f":"S!B3","v":"2020-11-25T09:30:00"},null,{"$f":"S!C3","v":"2020-11-25T22:00:00"},null,null,false,0]
[" ",null,"Katsushi Ikeuchi (Microsoft, University of Tokyo)",null,{"$f":"S!B6","v":44160.479166666672},null,null,null,null,null,0]
[]
["Oral 1A : Stereo and SfM"]
[171,null,"Neural Ray Surfaces for Self-Supervised Learning of Depth and Ego-motion",null,{"$f":"S!B4","v":"2020-11-25T10:30:00"},null,{"$f":"S!C4","v":"2020-11-25T23:00:00"},null,null,false,0]
[null,null,"Igor Vasiljevic; Greg Shakhnarovich; Vitor Guizilini; Adrien Gaidon; Rareș A. Ambruș; Sudeep Pillai; Wolfram Burgard",null,{"$f":"S!B10","v":44160.687500000007},null,{"$f":"S!C10","v":44161.125000000007},null,null,null,0]
{"$rows_left_out":307}
{"sheet":"MyChoice","index":1,"n_rows":326,"n_cols":7,"rows_kept":326,"cut":false,"hidden":false,"merged":[[320,4,321,4],[320,6,321,6],[322,4,323,4],[322,6,323,6],[324,4,325,4],[324,6,325,6],[314,4,315,4],[314,6,315,6],[316,4,317,4],[316,6,317,6],[318,4,319,4],[318,6,319,6],[308,4,309,4],[308,6,309,6],[310,4,311,4],[310,6,311,6],[312,4,313,4],[312,6,313,6],[302,4,303,4],[302,6,303,6],[304,4,305,4],[304,6,305,6],[306,4,307,4],[306,6,307,6],[296,4,297,4],[296,6,297,6],[298,4,299,4],[298,6,299,6],[300,4,301,4],[300,6,301,6],[290,4,291,4],[290,6,291,6],[292,4,293,4],[292,6,293,6],[294,4,295,4],[294,6,295,6],[284,4,285,4],[284,6,285,6],[286,4,287,4],[286,6,287,6],[288,4,289,4],[288,6,289,6],[278,4,279,4],[278,6,279,6],[280,4,281,4],[280,6,281,6],[282,4,283,4],[282,6,283,6],[272,4,273,4],[272,6,273,6],[274,4,275,4],[274,6,275,6],[276,4,277,4],[276,6,277,6],[266,4,267,4],[266,6,267,6],[268,4,269,4],[268,6,269,6],[270,4,271,4],[270,6,271,6],[260,4,261,4],[260,6,261,6],[262,4,263,4],[262,6,263,6],[264,4,265,4],[264,6,265,6],[254,4,255,4],[254,6,255,6],[256,4,257,4],[256,6,257,6],[258,4,259,4],[258,6,259,6],[248,4,249,4],[248,6,249,6],[250,4,251,4],[250,6,251,6],[252,4,253,4],[252,6,253,6],[242,4,243,4],[242,6,243,6],[244,4,245,4],[244,6,245,6],[246,4,247,4],[246,6,247,6],[236,4,237,4],[236,6,237,6],[238,4,239,4],[238,6,239,6],[240,4,241,4],[240,6,241,6],[230,4,231,4],[230,6,231,6],[232,4,233,4],[232,6,233,6],[234,4,235,4],[234,6,235,6],[224,4,225,4],[224,6,225,6],[226,4,227,4],[226,6,227,6],[228,4,229,4],[228,6,229,6],[218,4,219,4],[218,6,219,6],[220,4,221,4],[220,6,221,6],[222,4,223,4],[222,6,223,6],[212,4,213,4],[212,6,213,6],[214,4,215,4],[214,6,215,6],[216,4,217,4],[216,6,217,6],[206,4,207,4],[206,6,207,6],[208,4,209,4],[208,6,209,6],[210,4,211,4],[210,6,211,6],[200,4,201,4],[200,6,201,6],[202,4,203,4],[202,6,203,6],[204,4,205,4],[204,6,205,6],[194,4,195,4],[194,6,195,6],[196,4,197,4],[196,6,197,6],[198,4,199,4],[198,6,199,6],[188,4,189,4],[188,6,189,6],[190,4,191,4],[190,6,191,6],[192,4,193,4],[192,6,193,6],[182,4,183,4],[182,6,183,6],[184,4,185,4],[184,6,185,6],[186,4,187,4],[186,6,187,6],[176,4,177,4],[176,6,177,6],[178,4,179,4],[178,6,179,6],[180,4,181,4],[180,6,181,6],[170,4,171,4],[170,6,171,6],[172,4,173,4],[172,6,173,6],[174,4,175,4],[174,6,175,6],[164,4,165,4],[164,6,165,6],[166,4,167,4],[166,6,167,6],[168,4,169,4],[168,6,169,6],[158,4,159,4],[158,6,159,6],[160,4,161,4],[160,6,161,6],[162,4,163,4],[162,6,163,6],[152,4,153,4],[152,6,153,6],[154,4,155,4],[154,6,155,6],[156,4,157,4],[156,6,157,6],[146,4,147,4],[146,6,147,6],[148,4,149,4],[148,6,149,6],[150,4,151,4],[150,6,151,6],[140,4,141,4],[140,6,141,6],[142,4,143,4],[142,6,143,6],[144,4,145,4],[144,6,145,6],[134,4,135,4],[134,6,135,6],[136,4,137,4],[136,6,137,6],[138,4,139,4],[138,6,139,6],[128,4,129,4],[128,6,129,6],[130,4,131,4],[130,6,131,6],[132,4,133,4],[132,6,133,6],[122,4,123,4],[122,6,123,6],[124,4,125,4],[124,6,125,6],[126,4,127,4],[126,6,127,6],[116,4,117,4],[116,6,117,6],[118,4,119,4],[118,6,119,6],[120,4,121,4],[120,6,121,6],[110,4,111,4],[110,6,111,6],[112,4,113,4],[112,6,113,6],[114,4,115,4],[114,6,115,6],[104,4,105,4],[104,6,105,6],[106,4,107,4],[106,6,107,6],[108,4,109,4],[108,6,109,6],[98,4,99,4],[98,6,99,6],[100,4,101,4],[100,6,101,6],[102,4,103,4],[102,6,103,6],[92,4,93,4],[92,6,93,6],[94,4,95,4],[94,6,95,6],[96,4,97,4],[96,6,97,6],[86,4,87,4],[86,6,87,6],[88,4,89,4],[88,6,89,6],[90,4,91,4],[90,6,91,6],[80,4,81,4],[80,6,81,6],[82,4,83,4],[82,6,83,6],[84,4,85,4],[84,6,85,6],[74,4,75,4],[74,6,75,6],[76,4,77,4],[76,6,77,6],[78,4,79,4],[78,6,79,6],[68,4,69,4],[68,6,69,6],[70,4,71,4],[70,6,71,6],[72,4,73,4],[72,6,73,6],[62,4,63,4],[62,6,63,6],[64,4,65,4],[64,6,65,6],[66,4,67,4],[66,6,67,6],[56,4,57,4],[56,6,57,6],[58,4,59,4],[58,6,59,6],[60,4,61,4],[60,6,61,6],[50,4,51,4],[50,6,51,6],[52,4,53,4],[52,6,53,6],[54,4,55,4],[54,6,55,6],[44,4,45,4],[44,6,45,6],[46,4,47,4],[46,6,47,6],[48,4,49,4],[48,6,49,6],[38,4,39,4],[38,6,39,6],[40,4,41,4],[40,6,41,6],[42,4,43,4],[42,6,43,6],[32,4,33,4],[32,6,33,6],[34,4,35,4],[34,6,35,6],[36,4,37,4],[36,6,37,6],[26,4,27,4],[26,6,27,6],[28,4,29,4],[28,6,29,6],[30,4,31,4],[30,6,31,6],[20,4,21,4],[20,6,21,6],[22,4,23,4],[22,6,23,6],[24,4,25,4],[24,6,25,6],[14,4,15,4],[14,6,15,6],[16,4,17,4],[16,6,17,6],[18,4,19,4],[18,6,19,6],[8,4,9,4],[10,4,11,4],[12,4,13,4],[8,6,9,6],[10,6,11,6],[12,6,13,6],[0,0,1,6],[2,0,2,2],[3,0,3,2],[4,4,5,4],[6,4,7,4],[4,6,5,6],[6,6,7,6]]}
["3DV2020 MyChoice"]
[]
[]
[null,null,null,null,"1st Round",null,"2nd Round"]
[{"$f":"IFERROR(INDEX(MyProgram!$A$7:$G$326,SMALL(IF(MyProgram!$K$7:$K$326,ROW($A$1:$A$320)),ROW($A1)),COLUMN(A$1)),\"\")","v":""},{"$f":"IFERROR(INDEX(MyProgram!$A$7:$G$326,SMALL(IF(MyProgram!$K$7:$K$326,ROW($A$1:$A$320)),ROW($A1)),COLUMN(B$1)),\"\")","v":""},{"$f":"IFERROR(INDEX(MyProgram!$A$7:$G$326,SMALL(IF(MyProgram!$K$7:$K$326,ROW($A$1:$A$320)),ROW($A1)),COLUMN(C$1)),\"\")","v":""},{"$f":"IFERROR(INDEX(MyProgram!$A$7:$G$326,SMALL(IF(MyProgram!$K$7:$K$326,ROW($A$1:$A$320)),ROW($A1)),COLUMN(D$1)),\"\")","v":""},{"$f":"IFERROR(INDEX(MyProgram!$A$7:$G$326,SMALL(IF(MyProgram!$K$7:$K$326,ROW($A$1:$A$320)),ROW($A1)),COLUMN(E$1)),\"\")","v":""},{"$f":"IFERROR(INDEX(MyProgram!$A$7:$G$326,SMALL(IF(MyProgram!$K$7:$K$326,ROW($A$1:$A$320)),ROW($A1)),COLUMN(F$1)),\"\")","v":""},{"$f":"IFERROR(INDEX(MyProgram!$A$7:$G$326,SMALL(IF(MyProgram!$K$7:$K$326,ROW($A$1:$A$320)),ROW($A1)),COLUMN(G$1)),\"\")","v":""}]
[null,{"$f":"IFERROR(INDEX(MyProgram!$A$7:$G$326,SMALL(IF(MyProgram!$K$7:$K$326,ROW($A$1:$A$320)),ROW($A2)),COLUMN(B$1)),\"\")","v":""},{"$f":"IFERROR(INDEX(MyProgram!$A$7:$G$326,SMALL(IF(MyProgram!$K$7:$K$326,ROW($A$1:$A$320)),ROW($A2)),COLUMN(C$1)),\"\")","v":""},{"$f":"IFERROR(INDEX(MyProgram!$A$7:$G$326,SMALL(IF(MyProgram!$K$7:$K$326,ROW($A$1:$A$320)),ROW($A2)),COLUMN(D$1)),\"\")","v":""},null,{"$f":"IFERROR(INDEX(MyProgram!$A$7:$G$326,SMALL(IF(MyProgram!$K$7:$K$326,ROW($A$1:$A$320)),ROW($A2)),COLUMN(F$1)),\"\")","v":""}]
[{"$f":"IFERROR(INDEX(MyProgram!$A$7:$G$326,SMALL(IF(MyProgram!$K$7:$K$326,ROW($A$1:$A$320)),ROW($A3)),COLUMN(A$1)),\"\")","v":""},{"$f":"IFERROR(INDEX(MyProgram!$A$7:$G$326,SMALL(IF(MyProgram!$K$7:$K$326,ROW($A$1:$A$320)),ROW($A3)),COLUMN(B$1)),\"\")","v":""},{"$f":"IFERROR(INDEX(MyProgram!$A$7:$G$326,SMALL(IF(MyProgram!$K$7:$K$326,ROW($A$1:$A$320)),ROW($A3)),COLUMN(C$1)),\"\")","v":""},{"$f":"IFERROR(INDEX(MyProgram!$A$7:$G$326,SMALL(IF(MyProgram!$K$7:$K$326,ROW($A$1:$A$320)),ROW($A3)),COLUMN(D$1)),\"\")","v":""},{"$f":"IFERROR(INDEX(MyProgram!$A$7:$G$326,SMALL(IF(MyProgram!$K$7:$K$326,ROW($A$1:$A$320)),ROW($A3)),COLUMN(E$1)),\"\")","v":""},{"$f":"IFERROR(INDEX(MyProgram!$A$7:$G$326,SMALL(IF(MyProgram!$K$7:$K$326,ROW($A$1:$A$320)),ROW($A3)),COLUMN(F$1)),\"\")","v":""},{"$f":"IFERROR(INDEX(MyProgram!$A$7:$G$326,SMALL(IF(MyProgram!$K$7:$K$326,ROW($A$1:$A$320)),ROW($A3)),COLUMN(G$1)),\"\")","v":""}]
[null,{"$f":"IFERROR(INDEX(MyProgram!$A$7:$G$326,SMALL(IF(MyProgram!$K$7:$K$326,ROW($A$1:$A$320)),ROW($A4)),COLUMN(B$1)),\"\")","v":""},{"$f":"IFERROR(INDEX(MyProgram!$A$7:$G$326,SMALL(IF(MyProgram!$K$7:$K$326,ROW($A$1:$A$320)),ROW($A4)),COLUMN(C$1)),\"\")","v":""},{"$f":"IFERROR(INDEX(MyProgram!$A$7:$G$326,SMALL(IF(MyProgram!$K$7:$K$326,ROW($A$1:$A$320)),ROW($A4)),COLUMN(D$1)),\"\")","v":""},null,{"$f":"IFERROR(INDEX(MyProgram!$A$7:$G$326,SMALL(IF(MyProgram!$K$7:$K$326,ROW($A$1:$A$320)),ROW($A4)),COLUMN(F$1)),\"\")","v":""}]
[{"$f":"IFERROR(INDEX(MyProgram!$A$7:$G$326,SMALL(IF(MyProgram!$K$7:$K$326,ROW($A$1:$A$320)),ROW($A5)),COLUMN(A$1)),\"\")","v":""},{"$f":"IFERROR(INDEX(MyProgram!$A$7:$G$326,SMALL(IF(MyProgram!$K$7:$K$326,ROW($A$1:$A$320)),ROW($A5)),COLUMN(B$1)),\"\")","v":""},{"$f":"IFERROR(INDEX(MyProgram!$A$7:$G$326,SMALL(IF(MyProgram!$K$7:$K$326,ROW($A$1:$A$320)),ROW($A5)),COLUMN(C$1)),\"\")","v":""},{"$f":"IFERROR(INDEX(MyProgram!$A$7:$G$326,SMALL(IF(MyProgram!$K$7:$K$326,ROW($A$1:$A$320)),ROW($A5)),COLUMN(D$1)),\"\")","v":""},{"$f":"IFERROR(INDEX(MyProgram!$A$7:$G$326,SMALL(IF(MyProgram!$K$7:$K$326,ROW($A$1:$A$320)),ROW($A5)),COLUMN(E$1)),\"\")","v":""},{"$f":"IFERROR(INDEX(MyProgram!$A$7:$G$326,SMALL(IF(MyProgram!$K$7:$K$326,ROW($A$1:$A$320)),ROW($A5)),COLUMN(F$1)),\"\")","v":""},{"$f":"IFERROR(INDEX(MyProgram!$A$7:$G$326,SMALL(IF(MyProgram!$K$7:$K$326,ROW($A$1:$A$320)),ROW($A5)),COLUMN(G$1)),\"\")","v":""}]
[null,{"$f":"IFERROR(INDEX(MyProgram!$A$7:$G$326,SMALL(IF(MyProgram!$K$7:$K$326,ROW($A$1:$A$320)),ROW($A6)),COLUMN(B$1)),\"\")","v":""},{"$f":"IFERROR(INDEX(MyProgram!$A$7:$G$326,SMALL(IF(MyProgram!$K$7:$K$326,ROW($A$1:$A$320)),ROW($A6)),COLUMN(C$1)),\"\")","v":""},{"$f":"IFERROR(INDEX(MyProgram!$A$7:$G$326,SMALL(IF(MyProgram!$K$7:$K$326,ROW($A$1:$A$320)),ROW($A6)),COLUMN(D$1)),\"\")","v":""},null,{"$f":"IFERROR(INDEX(MyProgram!$A$7:$G$326,SMALL(IF(MyProgram!$K$7:$K$326,ROW($A$1:$A$320)),ROW($A6)),COLUMN(F$1)),\"\")","v":""}]
[{"$f":"IFERROR(INDEX(MyProgram!$A$7:$G$326,SMALL(IF(MyProgram!$K$7:$K$326,ROW($A$1:$A$320)),ROW($A7)),COLUMN(A$1)),\"\")","v":""},{"$f":"IFERROR(INDEX(MyProgram!$A$7:$G$326,SMALL(IF(MyProgram!$K$7:$K$326,ROW($A$1:$A$320)),ROW($A7)),COLUMN(B$1)),\"\")","v":""},{"$f":"IFERROR(INDEX(MyProgram!$A$7:$G$326,SMALL(IF(MyProgram!$K$7:$K$326,ROW($A$1:$A$320)),ROW($A7)),COLUMN(C$1)),\"\")","v":""},{"$f":"IFERROR(INDEX(MyProgram!$A$7:$G$326,SMALL(IF(MyProgram!$K$7:$K$326,ROW($A$1:$A$320)),ROW($A7)),COLUMN(D$1)),\"\")","v":""},{"$f":"IFERROR(INDEX(MyProgram!$A$7:$G$326,SMALL(IF(MyProgram!$K$7:$K$326,ROW($A$1:$A$320)),ROW($A7)),COLUMN(E$1)),\"\")","v":""},{"$f":"IFERROR(INDEX(MyProgram!$A$7:$G$326,SMALL(IF(MyProgram!$K$7:$K$326,ROW($A$1:$A$320)),ROW($A7)),COLUMN(F$1)),\"\")","v":""},{"$f":"IFERROR(INDEX(MyProgram!$A$7:$G$326,SMALL(IF(MyProgram!$K$7:$K$326,ROW($A$1:$A$320)),ROW($A7)),COLUMN(G$1)),\"\")","v":""}]
[null,{"$f":"IFERROR(INDEX(MyProgram!$A$7:$G$326,SMALL(IF(MyProgram!$K$7:$K$326,ROW($A$1:$A$320)),ROW($A8)),COLUMN(B$1)),\"\")","v":""},{"$f":"IFERROR(INDEX(MyProgram!$A$7:$G$326,SMALL(IF(MyProgram!$K$7:$K$326,ROW($A$1:$A$320)),ROW($A8)),COLUMN(C$1)),\"\")","v":""},{"$f":"IFERROR(INDEX(MyProgram!$A$7:$G$326,SMALL(IF(MyProgram!$K$7:$K$326,ROW($A$1:$A$320)),ROW($A8)),COLUMN(D$1)),\"\")","v":""},null,{"$f":"IFERROR(INDEX(MyProgram!$A$7:$G$326,SMALL(IF(MyProgram!$K$7:$K$326,ROW($A$1:$A$320)),ROW($A8)),COLUMN(F$1)),\"\")","v":""}]
[{"$f":"IFERROR(INDEX(MyProgram!$A$7:$G$326,SMALL(IF(MyProgram!$K$7:$K$326,ROW($A$1:$A$320)),ROW($A9)),COLUMN(A$1)),\"\")","v":""},{"$f":"IFERROR(INDEX(MyProgram!$A$7:$G$326,SMALL(IF(MyProgram!$K$7:$K$326,ROW($A$1:$A$320)),ROW($A9)),COLUMN(B$1)),\"\")","v":""},{"$f":"IFERROR(INDEX(MyProgram!$A$7:$G$326,SMALL(IF(MyProgram!$K$7:$K$326,ROW($A$1:$A$320)),ROW($A9)),COLUMN(C$1)),\"\")","v":""},{"$f":"IFERROR(INDEX(MyProgram!$A$7:$G$326,SMALL(IF(MyProgram!$K$7:$K$326,ROW($A$1:$A$320)),ROW($A9)),COLUMN(D$1)),\"\")","v":""},{"$f":"IFERROR(INDEX(MyProgram!$A$7:$G$326,SMALL(IF(MyProgram!$K$7:$K$326,ROW($A$1:$A$320)),ROW($A9)),COLUMN(E$1)),\"\")","v":""},{"$f":"IFERROR(INDEX(MyProgram!$A$7:$G$326,SMALL(IF(MyProgram!$K$7:$K$326,ROW($A$1:$A$320)),ROW($A9)),COLUMN(F$1)),\"\")","v":""},{"$f":"IFERROR(INDEX(MyProgram!$A$7:$G$326,SMALL(IF(MyProgram!$K$7:$K$326,ROW($A$1:$A$320)),ROW($A9)),COLUMN(G$1)),\"\")","v":""}]
[null,{"$f":"IFERROR(INDEX(MyProgram!$A$7:$G$326,SMALL(IF(MyProgram!$K$7:$K$326,ROW($A$1:$A$320)),ROW($A10)),COLUMN(B$1)),\"\")","v":""},{"$f":"IFERROR(INDEX(MyProgram!$A$7:$G$326,SMALL(IF(MyProgram!$K$7:$K$326,ROW($A$1:$A$320)),ROW($A10)),COLUMN(C$1)),\"\")","v":""},{"$f":"IFERROR(INDEX(MyProgram!$A$7:$G$326,SMALL(IF(MyProgram!$K$7:$K$326,ROW($A$1:$A$320)),ROW($A10)),COLUMN(D$1)),\"\")","v":""},null,{"$f":"IFERROR(INDEX(MyProgram!$A$7:$G$326,SMALL(IF(MyProgram!$K$7:$K$326,ROW($A$1:$A$320)),ROW($A10)),COLUMN(F$1)),\"\")","v":""}]
[{"$f":"IFERROR(INDEX(MyProgram!$A$7:$G$326,SMALL(IF(MyProgram!$K$7:$K$326,ROW($A$1:$A$320)),ROW($A11)),COLUMN(A$1)),\"\")","v":""},{"$f":"IFERROR(INDEX(MyProgram!$A$7:$G$326,SMALL(IF(MyProgram!$K$7:$K$326,ROW($A$1:$A$320)),ROW($A11)),COLUMN(B$1)),\"\")","v":""},{"$f":"IFERROR(INDEX(MyProgram!$A$7:$G$326,SMALL(IF(MyProgram!$K$7:$K$326,ROW($A$1:$A$320)),ROW($A11)),COLUMN(C$1)),\"\")","v":""},{"$f":"IFERROR(INDEX(MyProgram!$A$7:$G$326,SMALL(IF(MyProgram!$K$7:$K$326,ROW($A$1:$A$320)),ROW($A11)),COLUMN(D$1)),\"\")","v":""},{"$f":"IFERROR(INDEX(MyProgram!$A$7:$G$326,SMALL(IF(MyProgram!$K$7:$K$326,ROW($A$1:$A$320)),ROW($A11)),COLUMN(E$1)),\"\")","v":""},{"$f":"IFERROR(INDEX(MyProgram!$A$7:$G$326,SMALL(IF(MyProgram!$K$7:$K$326,ROW($A$1:$A$320)),ROW($A11)),COLUMN(F$1)),\"\")","v":""},{"$f":"IFERROR(INDEX(MyProgram!$A$7:$G$326,SMALL(IF(MyProgram!$K$7:$K$326,ROW($A$1:$A$320)),ROW($A11)),COLUMN(G$1)),\"\")","v":""}]
{"$rows_left_out":312}
{"sheet":"S","index":2,"n_rows":34,"n_cols":9,"rows_kept":34,"cut":false,"hidden":true,"merged":[]}
[null,"1st Round","2nd Round"]
[null,{"$f":"G2+H2/24","v":"2020-11-25T09:00:00"},null,"00:30:00","00:30:00",null,"2020-11-25",{"$f":"MyProgram!J2","v":9},14]
[null,{"$f":"B2+D2","v":"2020-11-25T09:30:00"},{"$f":"B2+13/24","v":"2020-11-25T22:00:00"},"01:00:00","01:00:00",null,null,null,13]
[null,"2020-11-25T10:30:00",{"$f":"C3+E3","v":"2020-11-25T23:00:00"},"00:30:00","00:30:00",null,null,null,12]
[null,"2020-11-25T11:00:00","2020-11-25T23:30:00","00:30:00","00:30:00",null,null,null,11]
[null,"2020-11-25T11:30:00","2020-11-26","02:30:00","00:30:00",null,null,null,10]
[null,"2020-11-25T14:00:00","2020-11-26T00:30:00","00:30:00","00:30:00",null,null,null,9]
[null,"2020-11-25T14:30:00","2020-11-26T01:00:00","00:30:00","00:30:00",null,null,null,8]
[null,"2020-11-25T15:00:00","2020-11-26T01:30:00","01:30:00","01:30:00",null,null,null,7]
[null,"2020-11-25T16:30:00","2020-11-26T03:00:00",null,null,null,null,null,6]
[null,"1st Round","2nd Round",null,null,null,null,null,5]
[null,null,{"$f":"C3+1","v":"2020-11-26T22:00:00"},null,"01:00:00",null,null,null,4]
[null,{"$f":"B4+1","v":"2020-11-26T10:30:00"},{"$f":"C12+E12","v":"2020-11-26T23:00:00"},"00:30:00","00:30:00",null,null,null,3]
[null,{"$f":"B13+D13","v":"2020-11-26T11:00:00"},"2020-11-26T23:30:00","00:30:00","00:30:00",null,null,null,2]
[null,"2020-11-26T11:30:00","2020-11-27","02:30:00","00:30:00",null,null,null,1]
{"$rows_left_out":19}